{"text_format":"3","workbook":"xlsx","n_sheets":10,"sheets":["INTRO","Gen Info","Pay & Allowances","Deductions","HRA","Salary","Assesment","Master","NSC INTT","RULES"],"not_rendered":{"images":3,"macros":1,"defined_names":10,"comments":3},"read":"whole","date_system":"1900"}

{"sheet":"INTRO","index":0,"n_rows":35,"n_cols":3,"rows_kept":35,"merged":[[0,0,20,0],[0,1,0,3],[1,1,1,2],[1,3,21,3],[2,1,2,2],[4,1,4,2],[15,2,19,2],[21,0,21,2]]}
[]
[null,"INCOME TAX ASSESMENT FOR FINANCIAL YEAR 2021-22"]
[null,"HOW TO USE   "]
[null,null,"राजस्थान राज्य कर्मचारियों के  लिए FY 2021-22 के लिए आयकर आकलन   बाबत इस UTILITY का प्रयोग किया जा सकता है । FILE को SAVE करने के लिए अपनी सुविधा से नाम देकर SAVE AS से Excel Macro- Enable Workbook के रूप में Save करें। file को open करते समय Enable Macro करें।यह excel utility केवल मात्र राज्य कार्मिको के income tax assesment के लिए सहायतार्थ तैयार की गई है ।यद्यपि इसे तैयार करने में पूर्ण सावधानी बरती गई है फिर भी किसी भूल चूक के लिए तैयार कर्ता उत्तरदायी नहीं है । किसी भी गणना के लिए त्रुटि पाए जाने पर आयकर विभाग के नियम मान्य होंगे  किसी प्रकार की तकनीकी कमी पाए जाने पर नीचे दिये गए EMAIL द्वारा अवगत कराने का श्रम करावे।(PLEASE USE LATEST VERSION OF THAT IS  OFFICE 2010 AND ABOVE FOR BEST RESULT)"]
[null,"   1. First Enable Macro whenever open file               2 Save as always in  Excel Macro-Enabled Workbook (*.xlsm)    "]
[null,"1.Gen Info Sheet :-","Gen Info शीट में कार्मिक की सामान्य सूचना, भरना है।शीट में महत्वपूर्ण स्थान पर आवश्यक निर्देश दिये गए है।वेतन से income tax कटौती को आपको manually MONTHLY भरना है।"]
[null,"2.PAY & Allowances Sheet :-","सर्वप्रथम माह मार्च 2021 का मूल वेतन F5 सेल मे लिखना है ।यदि वार्षिक वेतन वृद्धि को छोडकर acp या अन्य कारणो किसी माह मे वेतन मे बदलाव हुआ है तो सेल J2 मे माह क्रमांक और सेल M2 मे मूल वेतन लिखे।अन्य लागू भत्तो के संबन्धित सेल मे YES का चयन कर ड्रॉपडाउन या mannual डाटा भरे। यदि किसी माह में Fix वेतन मिला है तो सेल L12   में YES चयन कर  जिस माह मे FIX PAY मिला है उसके आगे YES अन्यथा NO का चयन करें।"]
[null,"3. Deductions SHEET","Deduction और Investment की एंट्री इस शीट मे करनी है ।अगर किसी प्रकार की अन्य आय को शामिल करना चाहते है तो CELL E6 मे एंट्री करनी है। SI कटौती ,80CCD1(B),RGHS एवं BONUS से संबन्धित विशेष सुविधा शीट के अंत मे आवश्यक दिशानिर्देश सहित दी गई है।"]
{"$rows_left_out":28}
{"sheet":"Gen Info","index":1,"n_rows":13,"n_cols":21,"rows_kept":13,"merged":[[1,1,2,5],[2,17,2,20],[3,1,3,5],[3,8,7,11],[3,17,3,18],[4,3,10,3],[4,17,4,18],[5,17,5,18],[6,17,6,18],[7,17,7,18],[8,17,8,18],[9,17,9,18],[11,1,11,5],[12,1,12,5]]}
[]
[null,"INCOME TAX ASSESMENT FOR FINANCIAL YEAR 2021-22"]
[{"$nulls":17},"SI PREMIUM FROM SALARY"]
[null,"GENERAL INFORMATION",{"$nulls":15},"PAY RANGE",null,"2018-03-01","2020-03-01"]
[null,"NAME OF EMPLOYEE","HANS RAJ JOSHI",null,"EMPLOYEE ID","RJGA199412341234",{"$nulls":11},"UPTO 22000",null,500,800]
[null,"Designation","Principal",null,"OFFICE","GOVT SENIOR SECONDARY SCHOOL 13DOL,SRI GANGANAGAR",{"$nulls":11},"22001 TO 28500",null,700,1200]
[null,"CADER","State Service",null,"PAY LEVAL","L-16",{"$nulls":11},"28501TO 46500",null,1300,2200]
[null,"Mobile No","999999999",null,"DOB","1975-01-01",{"$nulls":11},"46501 TO 72000",null,1800,3000]
{"$rows_left_out":6}
{"sheet":"Pay & Allowances","index":2,"n_rows":26,"n_cols":27,"rows_kept":26,"merged":[[2,4,2,11],[4,2,4,4],[4,5,4,6],[4,8,4,12],[5,2,5,6],[5,9,5,10],[7,2,7,4],[7,6,7,8],[7,9,7,10],[7,11,7,13],[8,9,8,10],[10,2,10,5],[10,11,10,13],[11,4,11,5],[11,11,11,13],[12,11,12,13],[13,2,13,7],[13,11,13,12],[14,2,14,4],[14,5,14,7],[14,11,14,12],[15,11,15,12],[16,11,16,12],[17,11,17,12],[18,11,18,12],[19,2,19,7],[19,11,19,12],[20,11,20,12],[21,11,21,12],[22,11,22,12],[23,11,23,12],[24,11,24,12],[25,11,25,12]]}
[]
[{"$nulls":22},1]
[{"$nulls":4},"Pay & Allowancess Details",{"$nulls":17},2]
[{"$nulls":22},3]
[null,null,"        मूल  वेतन (मार्च 2021 का)  F",null,null,78000,null,null,"मूल वेतन में परिवर्तन (एसीपी या अन्य कारण ,INCREMENT के अलावा) का माह क्रमांक",{"$nulls":13},4]
[null,null,"( 7वें वेतन आयोग के अनुसार ) ",{"$nulls":5},"माह क्रमांक",null,null,"मूल वेतन",{"$nulls":10},5]
[{"$nulls":22},6]
[null,null,"HRA का भुगतान उठाया है तो \"Yes \" अन्यथा \"No\" ड्रॉपडाउन से चुने                                    ",{"$nulls":3},"SURRENDER OF PL का भुगतान उठाया है तो \"Yes\",अन्यथा \"No\" चुने व जिस माह में भुगतान लिया है का क्रमांक चुने  \n",{"$nulls":4},"बोनस मिला है  तो \"Yes\" अन्यथा  \"No\" चुने और कितने माह का मिला है चयन करें",{"$nulls":10},7]
{"$rows_left_out":19}
{"sheet":"Deductions","index":3,"n_rows":36,"n_cols":19,"rows_kept":36,"merged":[[2,3,2,12],[4,1,4,19],[5,0,7,0],[5,1,5,3],[5,5,20,5],[5,18,20,19],[6,1,6,3],[6,6,6,15],[6,16,6,17],[7,1,7,3],[7,6,7,15],[7,16,7,17],[8,1,8,3],[8,6,8,15],[8,16,8,17],[9,1,9,3],[9,6,9,9],[9,11,9,12],[9,13,9,14],[9,16,9,17],[10,1,10,3],[10,6,10,15],[10,16,10,17],[11,1,11,3],[11,6,11,15],[11,16,11,17],[12,1,12,3],[12,6,12,15],[12,16,12,17],[13,1,13,3],[13,6,13,15],[13,16,13,17],[14,1,14,3],[14,6,14,8],[14,10,14,11],[14,13,14,14],[14,16,14,17],[15,1,15,3],[15,6,15,15],[15,16,15,17],[16,1,16,3],[16,6,16,15],[16,16,16,17],[17,1,17,3],[17,6,17,15],[17,16,17,17],[18,1,18,3],[18,6,18,15],[18,16,18,17],[19,1,19,3],[19,6,19,15],[19,16,19,17],[20,1,20,3],[20,6,20,15],[20,16,20,17],[21,1,21,5],[21,6,21,8],[21,9,21,11],[21,12,21,14],[22,1,22,19],[23,5,23,6],[23,14,23,15],[23,16,23,17],[23,18,23,19],[24,5,24,6],[24,14,24,15],[24,16,24,17],[24,18,24,19],[25,1,25,2],[25,7,25,9],[25,10,25,11],[27,1,27,19],[28,16,28,17],[30,2,31,4],[30,5,31,6],[30,10,31,12],[30,13,31,13],[30,14,30,15],[30,16,30,17],[31,14,31,15],[31,16,31,17],[34,2,35,4],[34,5,35,6],[34,10,35,14],[34,15,34,17],[35,15,35,17]]}
[]
[]
[{"$nulls":3},"Deductions and Investments Details"]
[]
[null,"वेतन एवं अन्य अतिरिक्त कटौतियों,अन्य आय /जमा राशि एवं छूट का विवरण "]
["OTHER INCOME","अन्य स्रोत से आय (FD पर ब्याज इत्यादि समस्त अन्य आय का योग )"]
[null," बचत खाते  की जमाराशि पर अर्जित ब्याज धारा (80TTA )  ",{"$nulls":4}," जीवन बीमा प्रीमियम -LIC (जो वेतन से काटा गया )",{"$nulls":9},{"v":469,"d":"469.00"}]
[null," वरिष्ठ नागरिकों को बचत खाते एवं स्थायी जमा खाते से प्राप्त ब्याज धारा (80TTB)  ",{"$nulls":4},"अन्य जमा राशि (धारा 80 C के अंतर्गत ) "]
{"$rows_left_out":29}
{"sheet":"HRA","index":4,"n_rows":23,"n_cols":13,"rows_kept":23,"merged":[[2,5,2,11],[4,1,4,2],[4,5,4,6],[6,7,6,11],[7,1,7,2],[8,11,9,12],[10,6,10,11],[11,9,11,10],[12,6,12,10],[13,7,13,10],[14,7,14,10],[15,7,15,10],[16,7,16,10],[17,6,17,10],[22,1,23,7]]}
[]
[]
[{"$nulls":5},"HRA EXEMPTION CALCULATOR"]
[]
[null,"\n मकान किराये का वास्तविक भुगतान  ( FOR HRA EXEMPTION )",{"$nulls":5},"HRA exemption ","Partially",{"$f":"IF(HRA!I5=\"Yearly\",Master!E27,Master!H27)","v":0},null,"Rent receipt required for max. HRA exemption",{"$f":"IF(HRA!I5=\"Yearly\",Master!E26,Master!H26)","v":202712}]
[]
[{"$nulls":7},"IF YOU ARE NOT ELIGIBLE TO GET HRA EXEMPTION FOR COMPLETE YEAR THEN CHOOSE PARTIALLY"]
[null,"PARTIALY HRA"]
{"$rows_left_out":16}
{"sheet":"Salary","index":5,"n_rows":34,"n_cols":44,"rows_kept":34,"merged":[[0,4,0,11],[0,14,0,30],[1,1,1,30],[2,1,2,30],[3,1,3,30],[4,1,4,4],[4,5,4,10],[4,11,4,13],[4,14,4,17],[4,18,4,19],[4,20,4,23],[4,24,4,27],[4,28,4,29],[5,3,5,6],[5,8,5,10],[5,11,5,12],[5,14,5,17],[5,18,5,19],[5,20,5,23],[5,24,5,25],[5,26,5,27],[6,1,6,11],[6,12,6,30],[9,36,9,39],[10,36,10,37],[11,36,11,37],[12,36,12,37],[13,36,13,37],[14,36,14,37],[15,36,15,37],[16,36,16,37],[17,36,17,37],[29,1,29,2],[30,7,30,10],[31,22,31,28]]}
[{"$nulls":14},"आप अपनी आवश्यकता अनुसार सैलरी शीट की UNLOCKED CELL मे बदलाव कर सकते है तथा REFRESH SALARY बटन पर क्लिक कर पुनः प्रारम्भिक स्थिति मे आ सकते है। ",{"$nulls":25},"cader"]
[{"$nulls":40},"State Service",null,null,"ALLOWANCES"]
[null,{"$f":"Master!AI3","v":"OFFICE OF THE PRINCIPAL GOVT SENIOR SECONDARY SCHOOL 13DOL,SRI GANGANAGAR"},{"$nulls":38},"Subordinate",null,null,"CCA"]
[null,{"$f":"Master!AI4","v":" SALARY STATEMENT FOR FINANCIAL YEAR 2021-22"},{"$nulls":38},"Ministrial",null,null,"WASHING ALLOWANCE"]
[null,"Name of the Employee",{"$nulls":3},{"$f":"IF('Gen Info'!C5=\"\",\"\",'Gen Info'!C5)","v":"HANS RAJ JOSHI"},{"$nulls":5},"Designation",null,null,{"$f":"IF('Gen Info'!$C$6=\"\",\"\",'Gen Info'!$C$6)","v":"Principal"},{"$nulls":3},"OFFICE",null,{"$f":"IF('Gen Info'!F6=\"\",\"\",'Gen Info'!F6)","v":"GOVT SENIOR SECONDARY SCHOOL 13DOL,SRI GANGANAGAR"},{"$nulls":3},"Date of Birth",{"$nulls":3},{"$f":"IF('Gen Info'!F8=\"\",\"\",'Gen Info'!F8)","v":"1975-01-01"},{"$nulls":11},"Class IV",null,null,"HANDICAPTED ALLWANCE"]
[null,"Employee ID",null,{"$f":"IF('Gen Info'!F5=\"\",\"\",'Gen Info'!F5)","v":"RJGA199412341234"},{"$nulls":3},"Cader",{"$f":"IF('Gen Info'!C7=\"\",\"\",'Gen Info'!C7)","v":"State Service"},null,null,"Employee Type",null,{"$f":"IF('Gen Info'!C11=\"\",\"\",IF('Gen Info'!C11=\"Yes\",\"NPS\",\"OPS\"))","v":"NPS"},{"$f":"IF('Gen Info'!C10=\"YES\",\"Salary From PD Head\",\"\")","v":""},{"$nulls":3},"PAN ",null,{"$f":"IF('Gen Info'!C9=\"\",\"\",'Gen Info'!C9)","v":"XXXXX1234X"},{"$nulls":3},"Pay leval",null,{"$f":"IF('Gen Info'!F7=\"\",\"\",'Gen Info'!F7)","v":"L-16"},null,"Pay March",{"$f":"Master!$AH$10","v":78000},{"$nulls":13},"ANY OTHER"]
[null,"PAY & ALLOWANCES",{"$nulls":10},"DEDUCTIONS"]
[null,"SN","MONTH","BASIC","DA","HRA","CCA","Bonus","ANY OTHER","ARREAR","Govt.NPS","Gross Salary",{"$f":"IF('Gen Info'!C11=\"YES\",\"NPS\",\"GPF\")","v":"NPS"},"GPF 2004","SIP","SI LOAN","GPF LOAN","HBA","HBA INT","LIC","RGHS","GIS","CM CORONA RELIEF","INCOME TAX","ANY OTHER","Govt.NPS","HITKARI NIDHI","Total Deduction","Net paid Amount","BILL NO","TV NO"]
{"$rows_left_out":27}
{"sheet":"Assesment","index":6,"n_rows":70,"n_cols":23,"rows_kept":70,"merged":[[0,0,0,17],[1,1,1,15],[1,16,2,16],[1,19,2,20],[2,1,2,14],[3,2,3,3],[3,4,3,9],[3,11,3,13],[3,15,3,16],[4,2,4,14],[4,19,5,21],[5,2,5,14],[6,2,6,14],[6,19,7,20],[6,21,7,21],[7,1,9,1],[7,2,7,11],[7,12,7,14],[7,15,8,16],[8,2,8,11],[8,12,8,14],[9,2,9,11],[9,12,9,14],[10,2,10,14],[10,19,11,19],[11,1,13,1],[11,2,11,9],[11,10,11,11],[11,12,11,14],[11,15,13,16],[12,2,13,3],[12,4,12,6],[12,7,12,9],[12,10,12,11],[12,12,12,14],[12,19,13,19],[12,20,13,21],[13,4,13,6],[13,7,13,9],[13,10,13,11],[13,12,13,14],[14,2,14,14],[14,19,15,21],[15,2,15,14],[16,2,16,14],[17,2,17,14],[18,2,18,14],[19,1,34,1],[19,2,19,14],[19,15,19,16],[20,2,20,16],[21,3,21,6],[21,10,21,12],[21,15,30,16],[22,3,22,6],[22,10,22,12],[23,3,23,6],[23,10,23,12],[24,3,24,6],[24,10,24,12],[25,3,25,6],[25,10,25,12],[25,20,27,20],[26,3,26,6],[26,10,26,12],[27,3,27,6],[27,10,27,12],[28,3,28,6],[28,10,28,12],[29,3,29,6],[29,10,29,12],[30,2,30,12],[31,2,31,14],[32,2,32,14],[33,2,33,14],[34,2,34,14],[35,2,35,16],[36,1,45,1],[36,3,36,14],[37,3,37,14],[38,3,38,14],[39,3,39,14],[40,3,40,14],[41,3,41,14],[42,3,42,14],[43,3,43,14],[44,3,44,14],[45,2,45,14],[46,2,46,14],[47,2,47,14],[48,2,48,14],[49,1,62,1],[49,2,49,14],[50,2,50,11],[50,12,50,14],[51,2,51,4],[51,5,51,8],[51,9,51,11],[51,12,51,13],[52,2,52,3],[52,5,52,7],[52,9,52,11],[52,12,52,13],[53,2,53,3],[53,5,53,7],[53,9,53,10],[53,12,53,13],[54,2,54,3],[54,5,54,7],[54,9,54,10],[54,12,54,13],[55,2,55,3],[55,5,55,7],[55,9,55,10],[55,12,55,13],[56,2,57,11],[56,12,56,13],[57,12,57,13],[58,2,58,14],[59,2,59,14],[60,2,60,14],[61,2,61,14],[62,2,62,14],[63,2,63,14],[64,2,64,14],[65,1,66,1],[65,2,66,4],[65,5,65,8],[65,9,65,10],[65,12,65,13],[65,15,65,16],[66,5,66,8],[66,9,66,10],[66,12,66,13],[66,15,66,16],[67,1,67,14],[68,2,68,5],[68,6,68,16]]}
[]
[null,{"$f":"Salary!B3","v":"OFFICE OF THE PRINCIPAL GOVT SENIOR SECONDARY SCHOOL 13DOL,SRI GANGANAGAR"},{"$nulls":14},{"$f":"IF($W$2=1,\"OLD REGIME\",\"NEW REGIME\")","v":"OLD REGIME"},{"$nulls":5},1]
[null,"आयकर गणना  प्रपत्र वर्ष 2021-22 (कर निर्धारण वर्ष 2022-23)",{"$nulls":13},{"$f":"P51","v":"1"}]
[null,1,"नाम कार्मिक ",null,{"$f":"'Gen Info'!C5","v":"HANS RAJ JOSHI"},{"$nulls":5},"पद",{"$f":"'Gen Info'!C6","v":"Principal"},null,null,"PAN :",{"$f":"'Gen Info'!C9","v":"XXXXX1234X"}]
[null,2,"आय : वर्ष 2021-22 में प्राप्त कुल वेतन (कर योग्य सुविधाओं के मूल्य सहित )",{"$nulls":12},"रु.",{"$f":"IF('Gen Info'!$C$11=\"NO\",SUM(Salary!$L$30,Master!$U$4),IF(AND('Gen Info'!$C$11=\"YES\",'Gen Info'!$C$10=\"YES\"),SUM(Salary!$L$30,Master!$U$4),SUM(Salary!$L$30,Salary!$M$30,Master!$U$4)))","v":{"v":1461408,"d":"1461408.00"}},null,null,"COMPARISION"]
[null,3,"गृह किराया, धारा 10(13-।) के अन्तर्गत एवं धारा 10(14)के अन्तगर्त अन्य भते जो कर मुक्त्त है",{"$nulls":12},"रु.",{"$f":"IF($P$3=\"1\",-SUM(HRA!$J$5,'Pay & Allowances'!$H$12),0)","v":{"v":0,"d":"0.00"}}]
[null,4,"                                                              शेष (2-3)",{"$nulls":12},"रु.",{"$f":"$Q$5+$Q$6","v":{"v":1461408,"d":"1461408.00"}},null,null,"OLD REGIME",null,"NEW REGIME"]
[null,5," (i)मनोरंजन भता धारा 16 (ii) के अन्तगर्त ( अधिकतम सीमा रू 5000 )",{"$nulls":9},{"$f":"IF($P$3=\"1\",IF('Pay & Allowances'!$I$12>5000,5000,'Pay & Allowances'!$I$12),0)","v":{"v":0,"d":"0.00"}}]
{"$rows_left_out":63}
{"sheet":"Master","index":7,"n_rows":100,"n_cols":57,"rows_kept":100,"hidden":true,"merged":[[0,0,0,18],[1,15,2,16],[1,17,2,17],[1,21,1,25],[1,26,1,30],[1,33,2,33],[2,21,2,23],[2,24,2,25],[2,26,2,27],[3,11,3,14],[3,26,3,27],[4,2,5,2],[4,3,5,3],[4,15,4,17],[4,26,4,27],[5,26,5,27],[6,26,6,27],[8,26,8,29],[8,40,8,41],[9,26,9,27],[10,26,10,27],[10,34,10,35],[11,26,11,27],[11,35,12,36],[12,26,12,27],[13,26,13,27],[14,26,14,27],[15,26,15,27],[16,21,16,22],[18,9,18,11],[18,12,18,14],[18,21,18,22],[19,2,19,3],[19,4,19,6],[20,1,20,3],[20,4,20,6],[21,1,21,3],[21,4,21,6],[22,1,22,3],[22,4,22,6],[23,1,23,3],[23,4,23,6],[24,4,24,6],[25,2,25,3],[25,4,25,6],[25,17,25,20],[26,2,26,3],[26,4,26,6],[26,16,26,18],[27,2,27,6],[27,11,27,12],[27,16,27,18],[29,17,29,18],[30,17,30,18],[39,0,39,15],[40,1,40,2],[40,16,40,17],[41,1,41,15],[42,1,42,15],[43,1,43,15],[44,0,46,0],[44,1,44,10],[44,13,44,15],[44,16,45,17],[45,1,45,10],[45,13,45,15],[46,1,46,10],[46,13,46,15],[47,1,47,15],[48,0,50,0],[48,1,48,8],[48,9,48,10],[48,13,48,15],[48,16,50,17],[49,1,50,2],[49,3,49,5],[49,6,49,8],[49,9,49,10],[49,13,49,15],[50,3,50,5],[50,6,50,8],[50,9,50,10],[50,13,50,15],[51,1,51,15],[52,1,52,15],[53,1,53,15],[54,1,54,15],[55,1,55,15],[56,0,71,0],[56,1,56,17],[57,1,57,17],[58,2,58,5],[58,9,58,13],[58,16,67,17],[59,2,59,5],[59,9,59,13],[60,2,60,5],[60,9,60,13],[61,2,61,5],[61,9,61,13],[62,2,62,5],[62,9,62,13],[63,2,63,5],[63,9,63,13],[64,2,64,5],[64,9,64,13],[65,2,65,5],[65,9,65,13],[66,2,66,5],[66,9,66,13],[67,1,67,13],[68,1,68,15],[69,1,69,15],[70,1,70,15],[71,1,71,15],[72,1,72,17],[73,1,73,15],[74,1,74,15],[75,1,75,15],[76,1,76,15],[77,1,77,15],[78,1,78,15],[79,0,80,0],[79,1,79,15],[80,1,80,13],[81,1,81,15],[82,1,82,15],[83,1,83,15],[84,1,84,15],[85,1,85,15],[86,9,86,16],[87,1,87,10],[87,13,87,16],[88,1,88,3],[89,4,89,8],[89,9,89,12],[89,13,89,14],[90,0,90,1],[90,4,90,6],[90,9,90,10],[90,13,90,14],[91,0,91,1],[91,4,91,6],[91,9,91,10],[91,13,91,14],[92,0,92,1],[92,4,92,6],[92,9,92,10],[92,13,92,14],[93,0,93,1],[93,4,93,6],[93,9,93,10],[93,13,93,14],[94,0,94,1],[94,4,94,6],[94,8,94,9],[94,13,94,14],[95,13,95,14],[96,14,96,16],[97,6,97,16],[99,1,99,15]]}
["Master Sheet"]
[{"$nulls":4},"EMPLOYEE TYPE",null,{"$f":"Salary!N6","v":"NPS"},null,{"$f":"'Gen Info'!F8","v":"1975-01-01"},{"$f":"'Gen Info'!C11","v":"Yes"},null,"Bonus",{"$f":"'Pay & Allowances'!L9","v":"No"},"Bonus months",{"$f":"'Pay & Allowances'!N9","v":6}," EMPLOYEE FROM MEDICAL DEP.,JUDICIARY DEP.POLICE CONSTABLE OR CLASS IV(L-1 TO L-4)",null,false,"HITKARI NIDHI",{"$f":"IFERROR(IF(OR(E3=\"All India Services\",E3=\"State Service\"),500,250),0)","v":500},"अन्य भत्ते",{"$nulls":5},"RGHS",{"$nulls":6},"RGHS FOR NPS"]
[null,{"$f":"'Gen Info'!C5","v":"HANS RAJ JOSHI"},null,{"$f":"'Gen Info'!C6","v":"Principal"},{"$f":"'Gen Info'!C7","v":"State Service"},null,{"$f":"'Gen Info'!F7","v":"L-16"},{"$f":"'Gen Info'!F5","v":"RJGA199412341234"},{"$f":"'Gen Info'!C9","v":"XXXXX1234X"},null,"HRA exemption",{"$f":"IF(M2=\"No\",0,ROUND((6774*O2/12),0))","v":0},{"$f":"ROUND(L3*50%,0)","v":0},{"$f":"L3-M3","v":0},{"$f":"IF(Deductions!P36=25%,1,2)","v":2},{"$nulls":3},"LIC SALARY",{"$f":"Deductions!Q7","v":469},"10(14)+16(iii)",{"$nulls":3},"deduction",null,"PAY RANGE",null,"2019-04-01","2020-04-01","ded","DIFFERENCE",null,null,{"$f":"CONCATENATE('Gen Info'!$E$6&\" OF THE \"&'Gen Info'!$F$9&\" \"&'Gen Info'!$F$10)","v":"OFFICE OF THE PRINCIPAL GOVT SENIOR SECONDARY SCHOOL 13DOL,SRI GANGANAGAR"}]
[null,{"$f":"AH10","v":78000},null,null,"HRA",null,"CCA","MARCH CCA","CPF",null,"SURRENDER","surrender  2021-22",{"$nulls":8},{"$f":"SUM('Pay & Allowances'!H12,'Pay & Allowances'!I12)","v":0},null,"2017-10-01","2018-03-01",{"$f":"IF(Salary!$D$11<23001,1450,IF(Salary!$D$11<28001,1625,IF(Salary!$D$11<38501,2100,IF(Salary!$D$11<51501,2850,IF(Salary!$D$11<62001,3575,IF(Salary!$D$11<72001,4200,IF(Salary!$D$11<80001,4800)))))))","v":4800},{"$f":"IF(Salary!$D$11<116001,6150,IF(Salary!$D$11<167001,8900,10500))","v":6150},"UP TO   18000",null,242,265,{"$f":"IF($G$2=\"OPS\",IF(Salary!$AD$6<18001,265,IF(Salary!$AD$6<33501,440,IF(Salary!$AD$6<54001,658,875))),\"\")","v":""},{"$f":"AD4-AC4","v":23},null,135," SALARY STATEMENT FOR FINANCIAL YEAR 2021-22"]
[null,null,"Salary","DA17% FROM JULY 28%",{"$f":"'Pay & Allowances'!C9","v":"Yes"},null,{"$f":"'Pay & Allowances'!C12","v":"No "},{"$f":"G7","v":0},{"$nulls":3},"month","pay","da","total","DEDUCTION",{"$nulls":6},500,1450,null,null,"18001 TO 33500",null,402,440,null,{"$f":"AD5-AC5","v":38},null,220]
[null,"Month",null,null,{"$f":"'Pay & Allowances'!E9","v":{"v":0.09,"d":"9%"}},{"$f":"IF('Pay & Allowances'!E9=18%,\"Y\",\"Z\")","v":"Z"},{"$f":"'Pay & Allowances'!E12","v":"KOTA"},null,"GROSS SALARY",null,"ITAX",{"$f":"IF('Pay & Allowances'!G9=\"Yes\",'Pay & Allowances'!$I$9,\"\")","v":10},{"$f":"IF(L6=\"\",0,IF(ISNA(ROUND(VLOOKUP($L$6,Master!$A$8:$D$19,3,0)/2,0)),0,ROUND(VLOOKUP($L$6,Master!$A$8:$D$19,3,0)/2,0)))","v":40150},{"$f":"IF(M6=\"\",\"\",IF(OR($L$6=4,$L$6=5,$L$6=6),ROUND(M6*17%,0),ROUND(M6*28%,0)))","v":11242},{"$f":"SUM(M6:N6)","v":51392},"RPMF","GPF1","GPF2","NPS/GPF","SI","Govt.NPS",null,650,1625,null,null,"33501 TO 54000",null,602,658,null,{"$f":"AD6-AC6","v":56},null,330]
[null,"march",{"$f":"Salary!D10","v":78000},{"$f":"IF(AND('Pay & Allowances'!$L$12=\"YES\",'Pay & Allowances'!$N$15=\"YES\"),0,ROUND($C$7*17%,0))","v":13260},{"$f":"IF($E$5=\"Yes\",IF(AND('Pay & Allowances'!$L$12=\"YES\",'Pay & Allowances'!$N15=\"YES\"),0,IF($F$6=\"Z\",ROUND($C7*($E$6-1%),0),IF($F$6=\"y\",ROUND($C7*($E$6-2%),0)))),0)","v":6240},null,{"$f":"IFERROR(IF(AND('Pay & Allowances'!$L$12=\"YES\",'Pay & Allowances'!$N15=\"YES\"),0,IF($G$5=\"Yes\",IF('Pay & Allowances'!$E$12=\"\",0,IF(AH10>23100,VLOOKUP($G$6,$R$20:$T$24,2,0),VLOOKUP($G$6,$R$20:$T$24,3,0))),0)),0)","v":0},null,{"$f":"Salary!L10","v":97500},null,{"$f":"Deductions!C25","v":3000},{"$nulls":4},{"$f":"IF(AND($G$2=\"OPS\",AH10>0),IF(AH10<=18000,265,IF(AH10<=33500,440,IF(AH10<=54000,658,875))),0)","v":0},{"$f":"IF(C7>80000,\"6150\",IF(C7>72000,\"4800\",IF(C7>62000,\"4200\",IF(C7>51500,\"3575\",IF(C7>38500,\"2850\",IF(C7>28500,\"2100\",IF(C7>23100,\"1625\",IF(C7>17700,\"1450\",\"0\"))))))))","v":"4800"},{"$f":"IF(C7>167000,\"10500\",IF(C7>116000,\"8900\",Q7))","v":"4800"},{"$f":"IF($G$2=\"NPS\",ROUND((C7+D7)*10%,0),R7)","v":9126},{"$f":"AE10","v":7000},{"$f":"IF(AND('Gen Info'!$C$10=\"YES\",$G$2=\"NPS\"),Master!S7,0)","v":0},null,1100,2100,null,null,"54001 & ABOVE",null,800,875,null,{"$f":"AD7-AC7","v":75},null,440]
[4,"april",{"$f":"Salary!D11","v":78000},{"$f":"IF(AND('Pay & Allowances'!$L$12=\"YES\",'Pay & Allowances'!N16=\"YES\"),0,ROUND(C8*17%,0))","v":13260},{"$f":"IF($E$5=\"Yes\",IF(AND('Pay & Allowances'!$L$12=\"YES\",'Pay & Allowances'!$N16=\"YES\"),0,IF($F$6=\"Z\",ROUND($C8*($E$6-1%),0),IF($F$6=\"y\",ROUND($C8*($E$6-2%),0)))),0)","v":6240},null,{"$f":"IFERROR(IF(AND('Pay & Allowances'!$L$12=\"YES\",'Pay & Allowances'!$N16=\"YES\"),0,IF($G$5=\"Yes\",IF('Pay & Allowances'!$E$12=\"\",0,IF(C8>23100,VLOOKUP($G$6,$R$20:$T$24,2,0),VLOOKUP($G$6,$R$20:$T$24,3,0))),0)),0)","v":0},null,{"$f":"Salary!L11","v":97500},null,{"$f":"Deductions!D25","v":3000},{"$nulls":4},{"$f":"IF(AND($G$2=\"OPS\",AH11>0),IF(AH11<=18000,265,IF(AH11<=33500,440,IF(AH11<=54000,658,875))),0)","v":0},{"$f":"IF(C8>80000,\"6150\",IF(C8>72000,\"4800\",IF(C8>62000,\"4200\",IF(C8>51500,\"3575\",IF(C8>38500,\"2850\",IF(C8>28500,\"2100\",IF(C8>23100,\"1625\",IF(C8>17700,\"1450\",\"0\"))))))))","v":"4800"},{"$f":"IF(C8>167000,\"10500\",IF(C8>116000,\"8900\",Q8))","v":"4800"},{"$f":"IF($G$2=\"NPS\",ROUND((C8+D8)*10%,0),R8)","v":9126},{"$f":"AE10","v":7000},{"$f":"IF(AND('Gen Info'!$C$10=\"YES\",$G$2=\"NPS\"),Master!S8,0)","v":0},null,1450,2850,{"$nulls":10},"ACP MONTH","pay after acp"]
{"$rows_left_out":93}
{"sheet":"NSC INTT","index":8,"n_rows":28,"n_cols":21,"rows_kept":28,"merged":[[1,0,1,20],[2,0,3,0],[2,1,2,20],[3,1,3,2],[3,3,3,4],[3,5,3,6],[3,7,3,8],[3,9,3,10],[3,11,3,12],[3,13,3,14],[3,15,3,16],[3,17,3,18],[3,19,3,20],[13,1,13,7],[14,1,16,1],[14,2,14,7],[14,10,14,12],[14,13,14,14],[15,2,15,3],[15,4,15,5],[15,6,15,7],[16,9,16,18]]}
[]
["NSC INTEREST CALCULATION\n(GIVE AMOUNT, PERIOD-WISE)"]
["PURCHASE PERIOD","Time of Purchase of NSC-(VIII Issue)"]
[null,"During 2012-13",null,"During 2013-14 to 2015-16",null,"During 01-04-2016 to30-09-2016",null,"During 01-10-2016 to31-03-2017",null,"During 01-04-2017 to30-06-2017",null,"During 01-07-2017 to31-12-2017",null,"During 01-01-2018 to30-09-2018",null,"During 01-10-2018 to30-06-2019",null,"During 01-07-2019 to11-12-2019",null,"During 12-12-2019 to31-03-2020"]
["Period (in years)","Amount","Interest","Amount","Interest","Amount","Interest","Amount","Interest","Amount","Interest","Amount","Interest","Amount","Interest","Amount","Interest","Amount","Interest","Amount","Interest"]
["1st year",null,{"$f":"B6*8.78%","v":{"v":0,"d":"0.00"}},100,{"$f":"D6*8.68%","v":8.68},null,{"$f":"F6*8.1%","v":0},null,{"$f":"H6*8%","v":{"v":0,"d":"0.00"}},null,{"$f":"J6*7.9%","v":{"v":0,"d":"0.00"}},null,{"$f":"L6*7.8%","v":{"v":0,"d":"0.00"}},null,{"$f":"N6*7.6%","v":{"v":0,"d":"0.00"}},100,{"$f":"P6*8%","v":{"v":8,"d":"8.00"}},100,{"$f":"R6*7.9%","v":{"v":7.9,"d":"7.90"}},100,{"$f":"T6*7.9%","v":{"v":7.9,"d":"7.90"}}]
["2nd year",null,{"$f":"B7*9.56%","v":{"v":0,"d":"0.00"}},null,{"$f":"D7*9.43%","v":{"v":0,"d":"0.00"}},null,{"$f":"F7*8.76%","v":0},null,{"$f":"H7*8.64%","v":{"v":0,"d":"0.00"}},5000,{"$f":"J7*8.52%","v":{"v":426,"d":"426.00"}},null,{"$f":"L7*8.41%","v":{"v":0,"d":"0.00"}},100,{"$f":"N7*8.18%","v":8.18},null,{"$f":"P7*8.64%","v":{"v":0,"d":"0.00"}},null,{"$f":"R7*8.52%","v":{"v":0,"d":"0.00"}},null,{"$f":"T7*8.52%","v":{"v":0,"d":"0.00"}}]
["3rd year",null,{"$f":"B8*10.4%","v":{"v":0,"d":"0.00"}},null,{"$f":"D8*10.25%","v":{"v":0,"d":"0.00"}},null,{"$f":"F8*9.46%","v":0},100,{"$f":"H8*9.33%","v":9.33},100,{"$f":"J8*9.2%","v":{"v":9.2,"d":"9.20"}},null,{"$f":"L8*9.06%","v":{"v":0,"d":"0.00"}},null,{"$f":"N8*8.8%","v":{"v":0,"d":"0.00"}},null,{"$f":"P8*9.33%","v":{"v":0,"d":"0.00"}},null,{"$f":"R8*9.2%","v":{"v":0,"d":"0.00"}},null,{"$f":"T8*9.2%","v":{"v":0,"d":"0.00"}}]
{"$rows_left_out":21}
{"sheet":"RULES","index":9,"n_rows":129,"n_cols":2,"rows_kept":129,"merged":[[0,0,0,1]]}
["                  Brief detail of Information and RULES for(Rates,Deductions,Exemption etc.)                                                                             ( Mini Ready Reckoner)"]
[null,"  Select and click any rule to know the brief detail about the taxation Rules & Informations."]
[1,"New Tax  Rates  for Financial-Year 2020-21, Assessment Year 2021-2022 in Old and New Regime"]
[2,"Some  Exempted Receipts / Special allowances &  Perquisite which are not chargable to tax in Old regime"]
[3,"Some Exempted Income ( to be shown while Return filing) "]
[4,"T A X   R U L E S  &  O T H E R   U S E F U L   I N F O R M A T I O N S"]
["I","HRA exemption-u/s 10(13A)"]
["II","Standard deduction u/s 16 (1a) instead of Transport allowance and Medical Reimbursement"]
{"$rows_left_out":121}