{"text_format":"3","workbook":"xlsx","n_sheets":6,"sheets":["Master Sheet","GA-55","Tax Old Regime","Tax New Regime","Form 16","Hra Receipt"],"not_rendered":{"images":1,"macros":1,"external_links":1,"defined_names":338},"read":"whole","date_system":"1900"}

{"sheet":"Master Sheet","index":0,"n_rows":35,"n_cols":68,"rows_kept":35,"merged":[[0,0,0,1],[0,2,0,9],[0,11,0,12],[0,13,0,14],[0,16,0,19],[0,20,0,24],[0,25,0,29],[0,30,0,33],[0,34,0,36],[0,37,0,38],[0,39,0,65],[1,0,3,0],[1,1,3,1],[1,2,3,2],[1,3,3,3],[1,4,3,4],[1,5,3,5],[1,6,3,6],[1,7,1,8],[1,10,1,15],[1,16,1,63],[2,7,3,7],[2,8,3,8],[2,9,3,9],[2,10,3,10],[2,11,2,15],[2,16,3,16],[2,17,2,24],[2,25,3,25],[2,28,2,39],[2,40,2,51],[2,52,2,63],[2,64,2,65]]}
["Office Name",null,"Govt. Sr. Sec. School Gordhanpura, Atru Baran",{"$nulls":7},"TAN No.","JDHG09699E",null,"HRA",null,{"v":0.09,"d":"9%"},"DDO NAME",{"$nulls":3},"Rajendra Kumar Chittora",{"$nulls":4},"DDO FATHERS NAME",{"$nulls":4},"Bhanwar Lal",{"$nulls":3},"DDO PAN NUMBER",null,null,"ABCPC2588K"]
["S.N.","Employee Name","Designation","PAN No.","GPF/GPF 2004","Bank A/c No.","Mobile No.","Surender Payment",null,"Bonus","Allowances",{"$nulls":5},"Deductions"]
[{"$nulls":7},"Yes/No","Month","Yes/No"," Basic Pay March 2024","Arrear if Any - प्राप्त व कटौती जो एरियर से हुई",{"$nulls":4},"S.I. मासिक","वार्षिक राशि भरें",{"$nulls":7},"HRA Rebate",null,null,"GPF/GPF 2004",{"$nulls":11},"INCOME TAX",{"$nulls":11},"LIC",{"$nulls":11},"मकान किराए की रशीद के लिए"]
[{"$nulls":11},"Basic","D.A.","HRA","GPF Ded.","ITax ",null,"G.I.S","HITKARINIDHI","House Loan Interest ","Tution Fees","LIC-जो पेमेंट से नहीं काटी जाती","PLI","सुकन्या"," धारा 80DD",{"$nulls":3},"2024-03-01","2024-04-01","2024-05-01","2024-06-01","2024-07-01","2024-08-01","2024-09-01","2024-10-01","2024-11-01","2024-12-01","2025-01-01","2025-02-01","2024-03-01","2024-04-01","2024-05-01","2024-06-01","2024-07-01","2024-08-01","2024-09-01","2024-10-01","2024-11-01","2024-12-01","2025-01-01","2025-02-01","2024-03-01","2024-04-01","2024-05-01","2024-06-01","2024-07-01","2024-08-01","2024-09-01","2024-10-01","2024-11-01","2024-12-01","2025-01-01","2025-02-01","मकान मालिक का नाम\t","पता"]
[1,2,3,4,5,6,7,8,9,10,11,12,13,14,15,16,17,18,19,20,21,22,23,24,25,26,null,null,27,28,29,30,31,32,33,34,35,36,37,38,39,40,41,42,43,44,45,46,47,48,49,50,51,52,53,54,55,56,57,58,59,60,61,62]
[1,"Parmanand Meghwal","Senior Teacher","XXXXXXXX","GPF 2004",61146986773,9784379510,"Yes",9,"Yes",37800,0,0,0,0,0,5000,700,250,0,30000,0,0,0,0,52740,{"$f":"MROUND(ROUND(1.03*K6,0),100)","v":38900},{"$f":"K6*4*9%+AA6*8*9%+N6","v":41616},2850,{"$f":"AC6","v":2850},{"$f":"AD6","v":2850},2850,2850,2850,2850,2850,2850,2850,2850,2850,null,{"$f":"AO6","v":0},{"$f":"AP6","v":0},0,0,0,0,0,0,0,0,0,1200,{"$f":"BA6","v":1200},{"$f":"BB6","v":1200},1200,1200,1200,1200,1200,1200,1200,1200,1200,"Vikas Sharma","Village Kawai Salpura, The atru Dist. Baran","Yes","Yes"]
[2,"Rajendra Kumar Chittora","Principal","XXXXXXXX","GPF",61198238909,9784135222,"No",8,"No",90400,0,0,0,0,0,4000,700,500,200000,0,0,1200,14000,0,94212,{"$f":"MROUND(ROUND(1.03*K7,0),100)","v":93100},{"$f":"K7*4*9%+AA7*8*9%+N7","v":99576},8000,{"$f":"AC7","v":8000},{"$f":"AD7","v":8000},{"$f":"AE7","v":8000},{"$f":"AF7","v":8000},{"$f":"AG7","v":8000},{"$f":"AH7","v":8000},{"$f":"AI7","v":8000},{"$f":"AJ7","v":8000},{"$f":"AK7","v":8000},{"$f":"AL7","v":8000},{"$f":"AM7","v":8000},5000,{"$f":"AO7","v":5000},5000,5000,5000,5000,5000,5000,5000,5000,5000,5000,2400,{"$f":"BA7","v":2400},2400,2400,2400,2400,2400,2400,2400,2400,2400,2400,"Harishankar Sharma","Village Kawai Salpura, The atru Dist. Baran","No","No"]
[3,"Kailash Chandra Nagar","Senior Teacher","XXXXXXXX","GPF 2004",61024509630,9413635185,"Yes",4,"Yes",51400,0,0,0,0,0,3000,700,250,0,0,0,0,0,0,56592,52900,56592,2850,2850,2850,2850,2850,2850,2850,2850,2850,2850,2850,2850,5000,{"$f":"AO8","v":5000},5000,5000,5000,5000,5000,5000,5000,5000,5000,5000,672,{"$f":"BA8","v":672},672,672,672,672,672,672,672,672,672,672,"Ankit Galav","Village Kawai Salpura, The atru Dist. Baran"]
[4,{"$nulls":25},0,0,null,0,0,0,0,0,0,0,0,0,0,0,null,{"$f":"AO9","v":0},0,0,0,0,0,0,0,0,0,0,null,{"$f":"BA9","v":0},0,0,0,0,0,0,0,0,0,0,null,null,4]
[5,{"$nulls":25},0,0,null,0,0,0,0,0,0,0,0,0,0,0,null,{"$f":"AO10","v":0},0,0,0,0,0,0,0,0,0,0,null,{"$f":"BA10","v":0},0,0,0,0,0,0,0,0,0,0,null,null,5]
[6,{"$nulls":25},0,0,null,0,0,0,0,0,0,0,0,0,0,0,null,{"$f":"AO11","v":0},0,0,0,0,0,0,0,0,0,0,null,{"$f":"BA11","v":0},0,0,0,0,0,0,0,0,0,0,null,null,6]
[7,{"$nulls":25},0,0,null,0,0,0,0,0,0,0,0,0,0,0,null,{"$f":"AO12","v":0},0,0,0,0,0,0,0,0,0,0,null,{"$f":"BA12","v":0},0,0,0,0,0,0,0,0,0,0,null,null,7,"GPF"]
[8,{"$nulls":25},0,0,null,0,0,0,0,0,0,0,0,0,0,0,null,{"$f":"AO13","v":0},0,0,0,0,0,0,0,0,0,0,null,{"$f":"BA13","v":0},0,0,0,0,0,0,0,0,0,0,null,null,8,"GPF 2004"]
[9,{"$nulls":25},0,0,null,0,0,0,0,0,0,0,0,0,0,0,null,{"$f":"AO14","v":0},0,0,0,0,0,0,0,0,0,0,null,{"$f":"BA14","v":0},0,0,0,0,0,0,0,0,0,0,null,null,9]
[10,{"$nulls":25},0,0,null,0,0,0,0,0,0,0,0,0,0,0,null,{"$f":"AO15","v":0},0,0,0,0,0,0,0,0,0,0,null,{"$f":"BA15","v":0},0,0,0,0,0,0,0,0,0,0,null,null,10]
{"$rows_left_out":21}
{"sheet":"GA-55","index":1,"n_rows":36,"n_cols":38,"rows_kept":36,"merged":[[0,2,0,28],[1,3,1,4],[1,5,1,7],[1,8,1,9],[1,10,1,13],[1,15,1,16],[1,18,1,20],[1,21,1,22],[1,23,1,26],[2,2,2,31],[3,2,3,28],[4,2,4,28],[5,3,6,7],[5,8,5,9],[5,10,5,13],[5,15,5,17],[5,20,5,22],[5,24,5,26],[5,27,5,28],[6,8,6,9],[6,12,6,19],[6,24,6,26],[6,27,6,28],[7,2,8,2],[7,3,7,13],[7,14,7,26],[7,28,8,28],[8,31,37,31],[37,2,37,28]]}
[null,null,"Please Install - Devlys 10 & Krutidev 10 Fonts"]
[{"$nulls":3},{"$f":"VLOOKUP(AF4,'Master Sheet'!A6:BL35,5,0)","v":"GPF 2004"},null,"Surrender",null,null,{"$f":"VLOOKUP(AF4,'Master Sheet'!A6:BL35,8,0)","v":"Yes"},null,"Surrender Month",{"$nulls":3},{"$f":"VLOOKUP(AF4,'Master Sheet'!A6:BL35,9,0)","v":9},"HRA",null,{"$f":"'Master Sheet'!P1","v":{"v":0.09,"d":"9%"}},"Bounus",null,null,{"$f":"VLOOKUP(AF4,'Master Sheet'!A6:BL35,10,0)","v":"Yes"},null,"Senior Citizen",{"$nulls":3},"No"]
[]
[null,null,{"$f":"'Master Sheet'!C1","v":"Govt. Sr. Sec. School Gordhanpura, Atru Baran"},{"$nulls":28},1]
[null,null,"INCOME TAX CALCULATION (GA-55) 2024-25"]
[null,null,"NAME :",{"$f":"VLOOKUP(AF4,'Master Sheet'!A6:BL35,2,0)","v":"Parmanand Meghwal"},{"$nulls":6},{"$f":"VLOOKUP(AF4,'Master Sheet'!A6:BL35,3,0)","v":"Senior Teacher"},{"$nulls":3},"PAN :",{"$f":"VLOOKUP(AF4,'Master Sheet'!A6:BL35,4,0)","v":"XXXXXXXX"},{"$nulls":3},"TAN:",{"$f":"'Master Sheet'!L1","v":"JDHG09699E"},{"$nulls":3},"A/C NO.",null,null,{"$f":"VLOOKUP(AF4,'Master Sheet'!A6:BL35,6,0)","v":61146986773}]
[{"$nulls":12},"RAJTEACHERS.NET",{"$nulls":11},"MOB NO.",null,null,{"$f":"VLOOKUP(AF4,'Master Sheet'!A6:BL35,7,0)","v":9784379510}]
[null,null,"Month","ALLOWANCES",{"$nulls":10},"DEDUCTIONS",{"$nulls":13},"Bill No. & T.V. No."]
[{"$nulls":3},"Basic Pay","Dearness Pay","Leave  Pay","Spl. Pay","D.A.","H.R.A.","Washing Allow.","ROP (If any, put the value in minus)","Other Allowance 1","Other Allowance 2","Gross  Salary",{"$f":"D2","v":"GPF 2004"},{"$f":"IF(D2=\"GPF\",\"GPF LOAN\",\"\")","v":""},"SI","SI LOAN + INT","RPMF/RGHS","LIC","G.I.S.","HBA Premium","HBA Interest","Income Tax / TDS","HITKARI NIDHI","Other","Total\nDeduction","Net Payment"]
[null,3,"2024-03-01",{"$f":"VLOOKUP(AF4,'Master Sheet'!A6:BL35,11,0)","v":37800},0,0,0,{"$f":"ROUND(50%*D10,0)","v":18900},{"$f":"IF($R$2=18%,ROUND(0.18*D10,0),ROUND(0.09*D10,0))","v":3402},0,0,0,0,{"$f":"SUM(D10:M10)","v":60102},{"$f":"VLOOKUP(AF4,'Master Sheet'!A6:BL35,29,0)","v":2850},0,{"$f":"VLOOKUP(AF4,'Master Sheet'!A6:BL35,17,0)","v":5000},0,{"$f":"IF(D10<18001,265,IF(D10<33501,440,IF(D10<54001,658,875)))","v":658},{"$f":"VLOOKUP(AF4,'Master Sheet'!A6:BL35,53,0)","v":1200},0,null,null,{"$f":"VLOOKUP(AF4,'Master Sheet'!A6:BL35,41,0)","v":0},null,null,{"$f":"SUM(O10:Y10)","v":9708},{"$f":"N10-AA10","v":50394},{"$nulls":4},4,{"$f":"IF(AG10='GA-55'!$O$2,\"Yes\",\"No\")","v":"No"},{"$f":"IF(AH10=\"Yes\",ROUND(D11/2,0),0)","v":0},{"$f":"IF(AH10=\"Yes\",ROUND(H10/2,0),0)","v":0}]
[null,4,"2024-04-01",{"$f":"D10","v":37800},{"$f":"IF(E$10=0,0,ROUND(D11/2,0))","v":0},{"$f":"IF(F$10=0,0,F10)","v":0},0,{"$f":"ROUND(50%*D11,0)","v":18900},{"$f":"IF($R$2=18%,ROUND(0.18*D11,0),ROUND(0.09*D11,0))","v":3402},{"$f":"IF(J$10=0,0,J10)","v":0},{"$f":"IF(K$10=0,0,K10)","v":0},0,{"$f":"IF(M$10=0,0,M10)","v":0},{"$f":"SUM(D11:M11)","v":60102},{"$f":"VLOOKUP(AF4,'Master Sheet'!A6:BL35,30,0)","v":2850},{"$f":"P10","v":0},{"$f":"Q10","v":5000},{"$f":"R10","v":0},{"$f":"IF(D11<18001,265,IF(D11<33501,440,IF(D11<54001,658,875)))","v":658},{"$f":"VLOOKUP(AF4,'Master Sheet'!A6:BL35,54,0)","v":1200},{"$f":"VLOOKUP(AF4,'Master Sheet'!A6:BL35,18,0)","v":{"v":700,"d":"700.00"}},{"$f":"V10","v":0},0,{"$f":"VLOOKUP(AF4,'Master Sheet'!A6:BL35,42,0)","v":0},0,null,{"$f":"SUM(O11:Y11)","v":10408},49694,{"$nulls":4},5,{"$f":"IF(AG11='GA-55'!$O$2,\"Yes\",\"No\")","v":"No"},{"$f":"IF(AH11=\"Yes\",ROUND(D12/2,0),0)","v":0},{"$f":"IF(AH11=\"Yes\",ROUND(H11/2,0),0)","v":0}]
[null,5,"2024-05-01",37800,{"$f":"IF($E$10=0,0,ROUND(D12/2,0))","v":0},0,0,18900,3402,0,{"$f":"IF(K$10=0,0,K11)","v":0},{"$f":"IF(L$10=0,0,L11)","v":0},0,60102,{"$f":"VLOOKUP(AF4,'Master Sheet'!A6:BL35,31,0)","v":2850},{"$f":"P11","v":0},{"$f":"Q11","v":5000},{"$f":"R11","v":0},658,{"$f":"VLOOKUP(AF4,'Master Sheet'!A6:BL35,55,0)","v":1200},0,0,0,{"$f":"VLOOKUP(AF4,'Master Sheet'!A6:BL35,43,0)","v":0},{"$f":"Y11","v":0},null,9708,50394,{"$nulls":4},6,{"$f":"IF(AG12='GA-55'!$O$2,\"Yes\",\"No\")","v":"No"},0,0]
[null,6,"2024-06-01",37800,0,0,0,18900,3402,0,0,0,0,60102,{"$f":"VLOOKUP(AF4,'Master Sheet'!A6:BL35,32,0)","v":2850},0,5000,0,658,{"$f":"VLOOKUP(AF4,'Master Sheet'!A6:BL35,56,0)","v":1200},0,0,0,{"$f":"VLOOKUP(AF4,'Master Sheet'!A6:BL35,44,0)","v":0},{"$f":"Y12","v":0},null,9708,50394,{"$nulls":4},7,{"$f":"IF(AG13='GA-55'!$O$2,\"Yes\",\"No\")","v":"No"},0,0,{"$f":"AI13+AJ13","v":0},{"$f":"IF(AH13=\"yes\",ROUND(AI13*3/100,0))","v":false}]
[null,7,"2024-07-01",{"$f":"MROUND(ROUND(1.03*D13,0),100)","v":38900},0,{"$f":"IF(F$10=0,0,F13)","v":0},{"$f":"IF(G$10=0,0,G13)","v":0},19450,3501,{"$f":"IF(J$10=0,0,J13)","v":0},{"$f":"IF(K$10=0,0,K13)","v":0},{"$f":"IF(L$10=0,0,L13)","v":0},{"$f":"IF(M$10=0,0,M13)","v":0},61851,{"$f":"VLOOKUP(AF4,'Master Sheet'!A6:BL35,33,0)","v":2850},{"$f":"P13","v":0},{"$f":"Q13","v":5000},{"$f":"R13","v":0},658,{"$f":"VLOOKUP(AF4,'Master Sheet'!A6:BL35,57,0)","v":1200},0,{"$f":"V13","v":0},{"$f":"W13","v":0},{"$f":"VLOOKUP(AF4,'Master Sheet'!A6:BL35,45,0)","v":0},{"$f":"Y13","v":0},null,9708,52143,{"$nulls":4},8,{"$f":"IF(AG14='GA-55'!$O$2,\"Yes\",\"No\")","v":"No"},0,0,0,{"$f":"IF(AH14=\"yes\",ROUND(AI14*3/100,0))","v":false}]
[null,8,"2024-08-01",{"$f":"D14","v":38900},0,0,0,19450,3501,0,0,0,0,61851,{"$f":"VLOOKUP(AF4,'Master Sheet'!A6:BL35,34,0)","v":2850},null,5000,0,658,{"$f":"VLOOKUP(AF4,'Master Sheet'!A6:BL35,58,0)","v":1200},0,0,0,{"$f":"VLOOKUP(AF4,'Master Sheet'!A6:BL35,45,0)","v":0},0,null,9708,52143,{"$nulls":4},9,{"$f":"IF(AG15='GA-55'!$O$2,\"Yes\",\"No\")","v":"Yes"},19450,9725,29175,584]
{"$rows_left_out":22}
{"sheet":"Tax Old Regime","index":2,"n_rows":65,"n_cols":19,"rows_kept":65,"merged":[[0,1,0,16],[1,1,1,16],[2,2,2,3],[2,4,2,9],[2,11,2,13],[2,15,2,16],[3,2,3,14],[4,2,4,14],[5,2,5,14],[6,2,6,14],[7,1,9,1],[7,2,7,11],[7,12,7,14],[7,15,8,16],[8,2,8,11],[8,12,8,14],[9,2,9,11],[9,12,9,14],[10,2,10,14],[11,1,13,1],[11,2,11,9],[11,10,11,11],[11,12,11,14],[11,15,13,16],[12,2,13,3],[12,4,12,6],[12,7,12,9],[12,10,12,11],[12,12,12,14],[13,4,13,6],[13,7,13,9],[13,10,13,11],[13,12,13,14],[14,2,14,14],[15,2,15,14],[16,2,16,14],[17,2,17,14],[18,1,32,1],[18,2,18,16],[19,2,19,16],[20,3,20,6],[20,10,20,12],[20,15,29,16],[21,3,21,6],[21,10,21,12],[22,3,22,6],[22,10,22,12],[23,3,23,6],[23,10,23,12],[24,3,24,6],[24,10,24,12],[25,3,25,6],[25,10,25,12],[26,3,26,6],[26,10,26,12],[27,3,27,6],[27,10,27,12],[28,3,28,6],[28,10,28,12],[29,2,29,12],[30,2,30,14],[31,2,31,14],[32,2,32,14],[33,1,43,1],[33,2,33,16],[34,2,34,14],[35,2,35,14],[36,2,36,14],[37,2,37,14],[38,2,38,14],[39,2,39,14],[40,2,40,14],[41,2,41,14],[42,2,42,14],[43,2,43,14],[44,2,44,14],[45,2,45,14],[46,2,46,14],[47,1,57,1],[47,2,47,16],[48,2,48,6],[48,7,48,10],[48,11,48,14],[49,2,49,4],[49,5,49,6],[49,7,49,9],[49,11,49,13],[50,2,50,4],[50,5,50,6],[50,7,50,9],[50,11,50,13],[51,2,51,4],[51,5,51,6],[51,7,51,9],[51,11,51,13],[52,2,52,4],[52,5,52,6],[52,7,52,9],[52,11,52,13],[53,2,53,14],[54,2,54,14],[55,2,55,14],[56,2,56,14],[57,2,57,14],[58,2,58,14],[59,2,59,14],[60,1,61,1],[60,2,61,4],[60,5,60,8],[60,9,60,10],[60,12,60,13],[60,15,60,16],[61,5,61,8],[61,9,61,10],[61,12,61,13],[61,15,61,16],[62,1,62,14],[64,3,64,4],[64,12,64,15],[66,2,68,16],[69,11,75,16],[74,3,74,9]]}
[null,{"$f":"'GA-55'!C4","v":"Govt. Sr. Sec. School Gordhanpura, Atru Baran"},{"$nulls":16},{"$f":"'GA-55'!AF4","v":1}]
[null,"आयकर गणना प्रपत्र वर्ष 2024-25 (कर निर्धारण वर्ष 2025-26)"]
[null,1,"नाम कर्मचारी :",null,{"$f":"'GA-55'!D6","v":"Parmanand Meghwal"},{"$nulls":5},"पद :",{"$f":"'GA-55'!K6","v":"Senior Teacher"},null,null,"PAN :",{"$f":"IF('GA-55'!P6=\"\",\"\",'GA-55'!P6)","v":"XXXXXXXX"}]
[null,2,"आय: वर्ष-2024-25 में प्राप्त कुल वेतन (कर योग्य सुविधाओं के मूल्य सहित)",{"$nulls":12},"रु.",{"$f":"'GA-55'!N31","v":{"v":785665,"d":"785665.00"}}]
[null,3,"(i) गृह किराया, धारा 10(13-A) के अंतर्गत जो कर मुक्त हैं।",{"$nulls":12},"रु.",{"$f":"VLOOKUP(S1,'Master Sheet'!A6:BL55,26,0)","v":{"v":52740,"d":"52740.00"}}]
[null,null,"(ii) धारा 10(14) के अंतर्गत अन्य भत्ते ",{"$nulls":12},"रु.",{"v":0,"d":"0.00"}]
[null,4,"                                                शेष (2-3)",{"$nulls":12},"रु.",{"$f":"Q4-Q5-Q6","v":{"v":732925,"d":"732925.00"}}]
[null,5,"(i) मनोरंजन भत्ता धारा 16(ii) के अंतर्गत (अधिकतम सीमा रु. 5000)",{"$nulls":9},{"v":0,"d":"0.00"}]
[null,null,"(ii) व्यवसाय कर धारा 16(iii) के अंतर्गत",{"$nulls":9},{"v":0,"d":"0.00"}]
[null,null,"(iii) स्टेंडर्ड डिडक्शन (Standard Deduction) 50,000 (अधिकतम)",{"$nulls":9},{"$f":"IF(Q7<50000,Q7,50000)","v":{"v":50000,"d":"50000.00"}},null,null,"रु.",{"$f":"SUM(M8:O10)","v":{"v":50000,"d":"50000.00"}}]
[null,6,"                                                                                             शेष (4-5)",{"$nulls":12},"रु.",{"$f":"Q7-Q10","v":{"v":682925,"d":"682925.00"}}]
[null,7,"(अ) गृह संपत्ति से आय (1)स्वयं के उपयोग में शून्य",{"$nulls":7},"(2) प्राप्त किराया रु.",null,{"v":0,"d":"0.00"}]
[null,null,"(ब) घटाये",null,"किराए का 30%",null,null,"गृह ऋण पर ब्याज",null,null,"गृहकर",null,"योग 7(ब)"]
[{"$nulls":4},0,null,null,{"$f":"VLOOKUP(S1,'Master Sheet'!A6:BL55,20,0)","v":0},null,null,0,null,{"$f":"E14+H14+K14","v":0}]
[null,null,"                                            शेष -/+(7(अ) एवं योग 7(ब) का",{"$nulls":12},"रु.",{"$f":"M12-M14","v":{"v":0,"d":"0.00"}}]
{"$rows_left_out":51}
{"sheet":"Tax New Regime","index":3,"n_rows":68,"n_cols":17,"rows_kept":68,"merged":[[0,1,0,16],[1,1,1,16],[2,2,2,3],[2,4,2,9],[2,11,2,13],[2,15,2,16],[3,2,3,14],[4,2,4,14],[5,2,5,14],[6,2,6,14],[7,1,9,1],[7,2,7,11],[7,12,7,14],[7,15,8,16],[8,2,8,11],[8,12,8,14],[9,2,9,11],[9,12,9,14],[10,2,10,14],[11,1,13,1],[11,2,11,9],[11,10,11,11],[11,12,11,14],[11,15,13,16],[12,2,13,3],[12,4,12,6],[12,7,12,9],[12,10,12,11],[12,12,12,14],[13,4,13,6],[13,7,13,9],[13,10,13,11],[13,12,13,14],[14,2,14,14],[15,2,15,14],[16,2,16,14],[17,2,17,14],[18,1,32,1],[18,2,18,16],[19,2,19,16],[20,3,20,6],[20,10,20,12],[20,15,29,16],[21,3,21,6],[21,10,21,12],[22,3,22,6],[22,10,22,12],[23,3,23,6],[23,10,23,12],[24,3,24,6],[24,10,24,12],[25,3,25,6],[25,10,25,12],[26,3,26,6],[26,10,26,12],[27,3,27,6],[27,10,27,12],[28,3,28,6],[28,10,28,12],[29,2,29,12],[30,2,30,14],[31,2,31,14],[32,2,32,14],[33,1,43,1],[33,2,33,16],[34,2,34,14],[35,2,35,14],[36,2,36,14],[37,2,37,14],[38,2,38,14],[39,2,39,14],[40,2,40,14],[41,2,41,14],[42,2,42,14],[43,2,43,14],[44,2,44,14],[45,2,45,14],[46,2,46,14],[47,1,60,1],[47,2,47,16],[48,2,48,6],[48,7,48,10],[48,11,48,14],[49,2,49,4],[49,5,49,6],[49,7,49,9],[49,11,49,13],[50,2,50,4],[50,5,50,6],[50,7,50,9],[50,11,50,13],[51,2,51,4],[51,5,51,6],[51,7,51,9],[51,11,51,13],[52,2,52,4],[52,5,52,6],[52,7,52,9],[52,11,52,13],[53,2,53,4],[53,5,53,6],[53,7,53,9],[53,11,53,13],[54,2,54,4],[54,5,54,6],[54,7,54,9],[54,11,54,13],[55,2,55,14],[56,2,56,14],[57,2,57,14],[58,2,58,14],[59,2,59,14],[60,2,60,14],[61,2,61,14],[62,2,62,14],[63,1,64,1],[63,2,64,4],[63,5,63,8],[63,9,63,10],[63,12,63,13],[63,15,63,16],[64,5,64,8],[64,9,64,10],[64,12,64,13],[64,15,64,16],[65,1,65,14],[67,3,67,5],[69,2,71,16],[72,11,78,16],[77,3,77,9]]}
[null,{"$f":"'GA-55'!C4","v":"Govt. Sr. Sec. School Gordhanpura, Atru Baran"}]
[null,"आयकर गणना प्रपत्र वर्ष 2024-25 (कर निर्धारण वर्ष 2025-26)"]
[null,1,"नाम कर्मचारी :",null,{"$f":"'GA-55'!D6","v":"Parmanand Meghwal"},{"$nulls":5},"पद :",{"$f":"'GA-55'!K6","v":"Senior Teacher"},null,null,"PAN :",{"$f":"IF('GA-55'!P6=\"\",\"\",'GA-55'!P6)","v":"XXXXXXXX"}]
[null,2,"आय: वर्ष-2024-25 में प्राप्त कुल वेतन (कर योग्य सुविधाओं के मूल्य सहित)",{"$nulls":12},"रु.",{"$f":"'GA-55'!N31","v":{"v":785665,"d":"785665.00"}}]
[null,3,"(i) गृह किराया, धारा 10(13-A) के अंतर्गत जो कर मुक्त हैं।",{"$nulls":12},"रु.",{"v":0,"d":"0.00"}]
[null,null,"(ii) धारा 10(14) के अंतर्गत अन्य भत्ते ",{"$nulls":12},"रु.",{"v":0,"d":"0.00"}]
[null,4,"                                                                                                 शेष (4-5)",{"$nulls":12},"रु.",{"$f":"Q4-Q5-Q6","v":{"v":785665,"d":"785665.00"}}]
[null,5,"(i) मनोरंजन भत्ता धारा 16(ii) के अंतर्गत (अधिकतम सीमा रु. 5000)",{"$nulls":9},{"v":0,"d":"0.00"}]
[null,null,"(ii) व्यवसाय कर धारा 16(iii) के अंतर्गत",{"$nulls":9},{"v":0,"d":"0.00"}]
[null,null,"(iii) स्टेंडर्ड डिडक्शन (Standard Deduction) 50,000 (अधिकतम)",{"$nulls":9},{"v":75000,"d":"75000.00"},null,null,"रु.",{"$f":"SUM(M8:O10)","v":{"v":75000,"d":"75000.00"}}]
[null,6,"                                                                                                             शेष (4-5)",{"$nulls":12},"रु.",{"$f":"Q7-Q10","v":{"v":710665,"d":"710665.00"}}]
[null,7,"(अ) गृह संपत्ति से आय (1)स्वयं के उपयोग में शून्य",{"$nulls":7},"(2) प्राप्त किराया रु.",null,{"v":0,"d":"0.00"}]
[null,null,"(ब) घटाये",null,"किराए का 30%",null,null,"गृह ऋण पर ब्याज",null,null,"गृहकर",null,"योग 7(ब)"]
[{"$nulls":4},{"$f":"ROUND(M12*0.3,0)","v":{"v":0,"d":"0.00"}},null,null,{"v":0,"d":"0.00"},null,null,{"v":0,"d":"0.00"},null,{"$f":"E14+H14+K14","v":{"v":0,"d":"0.00"}}]
[null,null,"                                            शेष -/+(7(अ) एवं योग 7(ब) का",{"$nulls":12},"रु.",{"$f":"M12-M14","v":{"v":0,"d":"0.00"}}]
{"$rows_left_out":54}
{"sheet":"Form 16","index":4,"n_rows":156,"n_cols":12,"rows_kept":156,"merged":[[0,0,0,11],[0,12,157,12],[1,0,1,11],[2,0,2,11],[3,0,3,11],[4,0,4,11],[5,0,5,5],[5,6,5,11],[6,0,6,5],[6,6,6,11],[7,0,7,5],[7,6,7,11],[8,0,9,5],[8,6,9,11],[10,0,10,2],[10,3,10,5],[10,6,10,11],[11,0,11,2],[11,3,11,5],[11,6,11,11],[12,3,14,5],[12,6,12,8],[12,9,12,11],[13,6,13,7],[13,9,14,11],[14,6,14,7],[16,0,16,1],[16,2,16,4],[16,5,16,6],[16,7,16,9],[16,10,16,11],[17,0,17,1],[17,2,17,4],[17,5,17,6],[17,7,17,9],[17,10,17,11],[18,0,18,1],[18,2,18,4],[18,5,18,6],[18,7,18,9],[18,10,18,11],[19,0,19,1],[19,2,19,4],[19,5,19,6],[19,7,19,9],[19,10,19,11],[20,0,20,1],[20,2,20,4],[20,5,20,6],[20,7,20,9],[20,10,20,11],[21,0,21,1],[21,2,21,4],[21,5,21,6],[21,7,21,9],[21,10,21,11],[22,0,22,11],[23,1,23,3],[23,4,23,11],[24,1,24,3],[24,4,24,5],[24,6,24,7],[24,8,24,9],[24,10,24,11],[25,4,25,5],[25,6,25,7],[25,8,25,9],[25,10,25,11],[26,1,26,3],[26,6,26,7],[26,8,26,9],[27,1,27,3],[27,4,27,5],[27,6,27,7],[27,8,27,9],[28,1,28,3],[28,4,28,5],[28,6,28,7],[28,8,28,9],[29,1,29,3],[30,1,30,3],[31,1,31,3],[32,1,32,3],[33,1,33,3],[34,1,34,3],[35,1,35,3],[35,4,35,5],[35,6,35,7],[35,8,35,9],[36,1,36,3],[36,4,36,5],[36,6,36,7],[36,8,36,9],[37,1,37,3],[37,4,37,5],[37,6,37,7],[37,8,37,9],[38,1,38,3],[38,4,38,5],[38,6,38,7],[38,8,38,9],[39,1,39,3],[40,1,40,3],[40,4,40,5],[40,6,40,7],[40,8,40,9],[42,0,42,11],[43,1,43,3],[43,4,43,11],[44,1,44,3],[44,4,44,5],[44,6,44,7],[44,8,44,9],[44,10,44,11],[45,4,45,5],[45,6,45,7],[45,8,45,9],[45,10,45,11],[46,1,46,3],[46,6,46,7],[46,8,46,9],[47,1,47,3],[47,6,47,7],[47,8,47,9],[48,1,48,3],[48,6,48,7],[48,8,48,9],[49,1,49,3],[49,6,49,7],[49,8,49,9],[50,1,50,3],[50,6,50,7],[50,8,50,9],[51,1,51,3],[51,6,51,7],[51,8,51,9],[52,1,52,3],[52,6,52,7],[52,8,52,9],[53,1,53,3],[53,6,53,7],[53,8,53,9],[54,1,54,3],[54,6,54,7],[54,8,54,9],[55,1,55,3],[55,6,55,7],[55,8,55,9],[56,1,56,3],[56,6,56,7],[56,8,56,9],[57,1,57,3],[57,6,57,7],[57,8,57,9],[58,1,58,3],[58,6,58,7],[58,8,58,9],[59,1,59,3],[60,1,60,3],[60,4,60,5],[60,6,60,11],[61,0,61,11],[62,1,62,3],[62,6,62,8],[63,0,63,2],[63,9,63,10],[64,0,64,4],[65,0,66,11],[67,0,67,1],[68,0,68,11],[69,0,69,11],[70,0,70,11],[71,0,71,11],[72,0,72,6],[73,0,73,11],[74,0,74,11],[75,0,75,11],[76,0,76,11],[77,0,77,11],[78,0,78,4],[81,0,81,11],[82,0,82,11],[89,9,89,10],[92,0,92,6],[93,0,93,6],[94,9,94,10],[108,6,110,7],[108,8,110,9],[108,10,110,11],[109,0,109,3],[111,6,111,7],[111,8,111,9],[111,10,111,11],[112,2,112,4],[112,6,112,7],[112,8,112,9],[112,10,112,11],[113,2,113,4],[113,6,113,7],[113,8,113,9],[113,10,113,11],[114,2,114,4],[114,6,114,7],[114,8,114,9],[114,10,114,11],[115,2,115,4],[115,6,115,7],[115,8,115,9],[115,10,115,11],[116,6,116,7],[116,8,116,9],[116,10,116,11],[117,2,117,4],[117,6,117,7],[117,8,117,9],[117,10,117,11],[118,6,118,7],[118,8,118,9],[118,10,118,11],[119,6,119,7],[119,8,119,9],[119,10,119,11],[120,6,120,7],[120,8,120,9],[120,10,120,11],[123,6,123,7],[123,8,123,9],[123,10,123,11],[124,6,124,7],[124,8,124,9],[124,10,124,11],[127,8,127,9],[127,10,127,11],[128,2,128,4],[128,6,128,7],[128,8,128,9],[128,10,128,11],[129,2,129,4],[129,6,129,7],[129,8,129,9],[129,10,129,11],[130,2,130,4],[130,6,130,7],[130,8,130,9],[130,10,130,11],[131,6,131,7],[131,8,131,9],[131,10,131,11],[132,10,132,11],[133,10,133,11],[135,10,135,11],[136,10,136,11],[137,10,137,11],[138,10,138,11],[139,10,139,11],[140,10,140,11],[141,10,141,11],[142,10,142,11],[143,10,143,11],[144,0,144,11],[145,1,145,3],[145,6,145,8],[146,0,146,2],[147,0,147,11],[152,5,152,11],[153,5,153,11],[154,0,154,2],[154,7,154,11],[155,0,155,2],[155,7,155,11],[156,5,156,11],[157,0,157,11]]}
["FORM NO.16"]
["[See rule 31 (1) (a)]"]
["Part A"]
["Certificate under section 203 of the Income Tax Act, 1961 for tax deducted"]
["at source from income chargeable under the head  “ Salaries “"]
["Name and address of the employer",{"$nulls":5},"Name and Designation of the employee"]
[{"$f":"'Master Sheet'!U1","v":"Rajendra Kumar Chittora"},{"$nulls":5},{"$f":"'GA-55'!D6","v":"Parmanand Meghwal"}]
["Principal",{"$nulls":5},{"$f":"'GA-55'!K6","v":"Senior Teacher"}]
[{"$f":"'GA-55'!C4","v":"Govt. Sr. Sec. School Gordhanpura, Atru Baran"},{"$nulls":5},{"$f":"A9","v":"Govt. Sr. Sec. School Gordhanpura, Atru Baran"}]
[]
["PAN of the Deducter",null,null,"TAN of the Deducter",null,null,"PAN of the Employee"]
[{"$f":"'Master Sheet'!AL1","v":"ABCPC2588K"},null,null,{"$f":"'GA-55'!U6","v":"JDHG09699E"},null,null,{"$f":"'GA-55'!P6","v":"XXXXXXXX"}]
["TDS Circle where annual",{"$nulls":5},"PERIOD",null,null,"Assessment Year"]
["return / statement under",{"$nulls":5},"FROM",null,"TO","2024-25"]
["section 206 is to be filed",{"$nulls":5},"01.04.2023",null,"31.03.2024"]
{"$rows_left_out":142}
{"sheet":"Hra Receipt","index":5,"n_rows":17,"n_cols":18,"rows_kept":17,"merged":[[0,0,0,3],[0,4,18,4],[0,5,1,8],[1,0,1,3],[2,0,2,3],[2,5,2,8],[3,0,3,3],[4,0,4,3],[5,5,5,8],[6,5,6,8],[7,5,7,8],[8,2,8,3],[8,5,8,8],[9,2,9,3],[9,5,18,6],[9,7,18,8],[12,0,12,1],[13,0,15,1]]}
["RECEIPT OF HOUSE RENT",{"$nulls":4},"RAJTEACHERS.NET"]
["Under Section 1 (13 – A) of Income Tax Act",{"$nulls":8},{"$f":"'GA-55'!AF4","v":1}]
[{"$nulls":5},"HRA REBATE CALCULATION",{"$nulls":3},{"$f":"'GA-55'!D6","v":"Parmanand Meghwal"}]
[{"$f":"CONCATENATE(J4,\" \",R4,\" \",I5,\" \",K4,\" \",R4,\" \",J7,\") \",M4,\" \",R4,\" \",J6,\" \",N4,\" \",N5,\" \",O4,\" \",O5,\" \",P4,\" \",J3,\" \",Q4,)","v":{"$error":"#NAME?"}},{"$nulls":4},"मकान किराया छूट के रशीद की आवश्यकता       (12 माह के लिए)","एक माह का किराया (रशीद की राशि इस राशि से कम नहीं हो सकती)","आप द्वारा चुकाया गया एक माह का किराया यहाँ भरें","आप द्वारा चुकाया गया 12 माह का किराया ","Received a sum of Rs.","(Rupees","only)","towards House Rent @ Rs. (Rupees","per month from","to","from Dr/Sri/Smt","in respect of House No - ","-"]
["Situated at",{"$nulls":4},{"$f":"L5","v":126989.3},{"$f":"M5","v":10582},{"$f":"G5","v":10582},{"$f":"H5*12","v":126984},{"$f":"'Tax Old Regime'!Q5","v":{"v":52740,"d":"52740.00"}},{"$f":"'GA-55'!N31-'GA-55'!I31","v":742493},{"$f":"IF(J5>=1,(K5*10%+J5),J5)","v":126989.3},{"$f":"ROUND(L5/12,0)","v":10582},"Feb","March"]
["………………………………………………………………….",{"$nulls":8},{"$f":"SpellNumber(H5)","v":{"$error":"#NAME?"}}]
["………………………………………………………………….",{"$nulls":4},"CREATED BY",{"$nulls":3},{"$f":"SpellNumber(I5)","v":{"$error":"#NAME?"}}]
["………………………………………………………………….",{"$nulls":4},"PARMANAND MEGHWAL, SENIOR TEACHER"]
[null,null,"(Affix Revenue Stamp of Rs.1/-)",null,null,"GUPS KANWARPURA, ATRU- BARAN"]
[null,null,"Signature of the House Owner",null,null,"साथियों नमस्कार! यह शीट वित्तीय वर्ष 2023-24 के आयकर गणना हेतु बनाई गयी है, इसके द्वारा आप एक से अधिक कार्मिकों का आयकर गणना कर सकते हैं, शीट को सावधानीपूर्वक व आयकर विभाग के नियमों के अनुरूप बनाया गया है, किसी प्रकार की गलती के लिए आपके विचार अपेक्षित हैं।"]
["Date:"]
["Name",{"$f":"VLOOKUP(J2,'Master Sheet'!A6:BN35,65,0)","v":"Vikas Sharma"}]
["Address:-"]
[{"$f":"VLOOKUP(J2,'Master Sheet'!A6:BN35,66,0)","v":"Village Kawai Salpura, The atru Dist. Baran"}]
[]
{"$rows_left_out":2}